Mantis Bugtracker          
testlink.org

TestLink - Change Log

TestLink - 1.9.10 (2014 Q1 - bug fixing) (Released 2014-04-25) View Issues ]
==============================================================
- 0005726: [Test Specification] Table view (simple) for children test cases (fman) - closed.
- 0005239: [Reports] General Test Plan Metrics page blank (fman) - closed.
- 0004988: [Installer] manual migration 1.9.3 to 1.9.4 (fman) - closed.
- 0005073: [Reports] Test report "General Test Plan Metrics" function failed (Migration from 1.8.x to 1.9.3) (fman) - closed.
- 0004904: [Bug Tracking Systems Integration] integrate with ITS on test project basis (fman) - closed.
- 0006402: [Bug Tracking System - JIRA Integration] Create JIRA Ticket FAILURE => com.atlassian.jira.rpc.exception.RemoteValidationException: {customfield_10000=Component is requir (fman) - closed.
- 0006048: [Available Fixes] Availables hot-fixes for 1.9.9 & How To get full fixed package from gitorious (fman) - closed.
 - 0006066: [User Interface General] Testlink "Home" link on login screen incorrect (fman) - closed.
 - 0006076: [API - XMLRPC] addPlatformToTestPlan creates invalid platform links (fman) - closed.
 - 0006082: [Requirements Import - TL XML format] Import req from DocBook to testlink ignore of $tlCfg->req_cfg->importDocBook->requirement var (fman) - closed.
 - 0006083: [Reports] Test Plan Execution report on SPECIFIC BUILD (fman) - closed.
 - 0006084: [Test Specification - Move/Copy Test Cases] Cannot copy a testcase with (attached) linked requirements (fman) - closed.
 - 0006085: [Test Specification - Move/Copy Test Cases] Move/Copy Test Cases Feature ON TEST SUITE - do not offer chance to choose [Copy Requirement Assignments] (fman) - closed.
 - 0006060: [Test Plan Management] Test Plan attachment management refactoring (fman) - closed.
 - 0006059: [Requirement Management] Requirement - attachment management refactoring (fman) - closed.
 - 0006049: [Test Specification] Test Suite attachment management refactoring (fman) - closed.
 - 0006056: [Test Execute] Execute with tree refresh, refresh also right pane removing exec data from user view (fman) - closed.
 - 0006054: [Requirement Management] Req. Specification attachment management refactoring (fman) - closed.
 - 0006051: [Export/Import] Extension of file exported is php instead of xml, when you export Platforms (fman) - closed.
 - 0006121: [Bug Tracking System - TRAC Integration] isResolved property not set for TRAC (fman) - closed.
 - 0004218: [Export/Import] Import of Custom Fields Failing due to spaces... (fman) - closed.
 - 0006028: [Bug Tracking System - JIRA Integration] Integration with Jira 6.1 broken. - Due to JIRA schema changes (fman) - closed.
 - 0006109: [API - XMLRPC] createTestCaseSteps with action 'update' does not change existing steps (fman) - closed.
 - 0006123: [Reports - Test report matrix] Showing test results gives invalid index warning in events (fman) - closed.
 - 0006124: [Localization] Updated some missing localization strings for Dutch (fman) - closed.
 - 0006125: [Reports] Warning about arg_build_set being undefined when exporting to Excel (fman) - closed.
 - 0006126: [Bug Tracking System - TRAC Integration] Warning about unknown property "id" (fman) - closed.
 - 0006128: [GUI] Test Specification - Icon to show/hide actions on Test Project and Test Suites (fman) - closed.
 - 0006129: [GUI] Test Specification - Icon to show/hide actions on Test Case (fman) - closed.
 - 0006136: [GUI] Requirement Specification - Icon to show/hide actions for REQUIREMENTS (fman) - closed.
 - 0006102: [API - XMLRPC] updateTestCase returns debug informations (fman) - closed.
 - 0006101: [API - XMLRPC] updateTestCase does not set modification timestamp (fman) - closed.
 - 0006135: [GUI] Requirement Specification - Icon to show/hide actions Req. Spec (fman) - closed.
 - 0006097: [GUI] Access to test specification feature from desktop - right pane will present test project data instead of help (fman) - closed.
 - 0006098: [GUI] Access to REQUIREMENTS specification feature from desktop - right pane will present ACTIONS instead of help (fman) - closed.
 - 0006099: [GUI] Keyword Assignment feature - cleanup GUI (fman) - closed.
 - 0006149: [Build Management] Build View - possibility to set active/inactive, open/close on quick way (fman) - closed.
 - 0006144: [Third party components] jquery and prototype third party packages CONFLICT (fman) - closed.
 - 0006137: [Test Plan Management] Test plan list view - display quantity of builds (fman) - closed.
 - 0006164: [Requirement to Test Case Assignment] One requirement link same test case duplicated if the test case has more then one version. (fman) - closed.
 - 0006179: [Test Execute] Cannot remove already executed test case (demo.testlink.org) (fman) - closed.
 - 0006193: [Database Postgres] DB Access Error after upgrade 1.9.7->1.9.8->1.9.9 (fman) - closed.
 - 0006197: [Database MS-SQL] 1.9.8 Upgrade - req_coverage table (fman) - closed.
 - 0006175: [Reports] Add "Execution time" to "Results by Tester per Build" report (fman) - closed.
 - 0006185: [API - XMLRPC] reportTCResults() - new parameter 'user' (user login) (fman) - closed.
 - 0006159: [API - XMLRPC] getTestCasesForTestPlan returns confusing exec_status [POSTGRESQL] (fman) - closed.
 - 0006210: [Bug Tracking System - Redmine Integration] Bug creation via API (redmine connection) is not working (fman) - closed.
 - 0006218: [Reports] Report Metrics Dashboard - Test Project Progress Section is always empty (fman) - closed.
 - 0006216: [Test Plan - Assign Test Case Execution] Crash when changing from TestPlan with Builds to TestPlan with NO Builds in the "Assign Test Case Execution" Window (fman) - closed.
 - 0006223: [Metrics Dashboard] Metrics dashboard doesn't show up (fman) - closed.
 - 0006206: [Test Specification Export] Add the test case status in XML export (fman) - closed.
 - 0006204: [Test Specification Import] Import Estimated exec. duration from XML (fman) - closed.
 - 0006203: [Test Specification Export] XML test specification export doesn't contain Estimated exec. element (fman) - closed.
 - 0006202: [API - XMLRPC] assignRequirements() calls assign_to_tcase() without author_id argument (fman) - closed.
 - 0006207: [Test Specification Import] import the test case status from XML (fman) - closed.
 - 0006215: [Custom fields] Custom DATE fields in 64bit OS systems show 30/10/-2 by default instead of being empty (fman) - closed.
 - 0006260: [Export/Import] TestLink redirects the user to a blank page when importing platform using an invalid XML (fman) - closed.
 - 0000898: [New Feature] Display IMAGE attachments in line (fman) - closed.
 - 0005031: [New Feature] Automatically create user account at the first time of login if the account just exists on LDAP (fman) - closed.
 - 0006250: [Users and Rights] Cannot set new rights after upgrade to 1.9.8 (fman) - closed.
 - 0006229: [Requirement to Test Case Assignment] Error "Stack overflow in line: 7" (prototype.js and ext-js compatibility issue) (fman) - closed.
 - 0006236: [Test Plan - Add/Remove Test Cases] Option to display whole test specification (filtered) on right pane (fman) - closed.
 - 0006261: [Test Specification] Test suite 'Sort alphabetically' is not working properly (fman) - closed.
 - 0006266: [Test Specification] No error message when failing to attach a file greater than the maximum size (fman) - closed.
 - 0006281: [Filters - Test Specification] Importance Filter is based on Version 1 only (fman) - closed.
 - 0006289: [Bug Tracking System - Mantis Integration] Mantis Category not used (fman) - closed.
 - 0006141: [Test Execute] Add "Import XML Results" button (fman) - closed.
 - 0006110: [Test Execute] Replace help on right pane with exec summary regarding Test plan, Build, Platform (fman) - closed.
 - 0006253: [Reports] Display Attached Images on reports when displayed like HTML online (fman) - closed.
 - 0006307: [API - XMLRPC] XML-RPC API getTestCasesForTestSuite() - add option to return also test case keywords (fman) - closed.
 - 0006303: [Custom fields] Facility for linking the Custom field to Builds only (fman) - closed.
 - 0006100: [Roles] Divide & Conquer - rights with more granularity (fman) - closed.
 - 0006257: [Bug Tracking System - Bugzilla Integration] Junk values of Bugzilla ID and Bugzilla key in Exported Spreadsheet on Failed Test Case Report (fman) - closed.
 - 0006061: [Requirements Import - Mantis XML format] Create Req. from Mantis Issue XML export (fman) - closed.
 - 0006213: [API - XMLRPC] Test plan access rights not checked on API - XMLRPC (fman) - closed.
 - 0005055: [API - XMLRPC] Error attaching file via XMLRPC API (kinow) - closed.
 - 0006259: [Reports - Test report matrix] Test report matrix - Spreadsheet output - display more info that on HTML output (fman) - closed.
 - 0006108: [API - XMLRPC] createTestCaseSteps creates steps without test case references (fman) - closed.
 - 0006068: [Bug Tracking Systems Integration] JIRA REST API Integration - CRITIC ONLY via HTTPS (fman) - closed.
 - 0006138: [Test Specification] Test Specification - Add buttons to Generate Test Spec Document on Test Project and Test suite (fman) - closed.
- 0005489: [Custom fields] Mandatory Field Parameter for Custom Fields (fman) - closed.
- 0005018: [User Interface General] collapse/expand Icon won't toggle (fman) - closed.
- 0005174: [Assign Test Case Execution] Many builds -> Assigning Test Case Execution -> Right frame does not automatically refresh (fman) - closed.
- 0005295: [Reports] Test Report: Result is displayed for untested test case version (fman) - closed.
- 0006339: [Test Specification - Move/Copy Test Cases] Assigned requirements not copied when copying test (fman) - closed.
- 0006400: [Bug Tracking System - JIRA Integration] Create JIRA Ticket FAILURE (fman) - closed.
- 0005321: [Test Specification] Test Case Execution Types - Possibility to add custom values (fman) - closed.
- 0002860: [Integration with Other Systems] When adding a bug to a Test case, it only puts in the number (fman) - closed.
- 0006087: [Contribution Maintained BY USER] Import RESULTS - import test EXECUTION duration through xml files (fman) - closed.
- 0006112: [Test Execute - Filters] Filter by "bug" when execute tests (fman) - closed.
- 0006127: [Test Execute] unable to execute test case with linked requirement using TL1.9.9 hotfix package - file inc_exec_test_spec_req.tpl missing (fman) - closed.
- 0006089: [Bug Tracking System - JIRA Integration] JIRA Soap Object in main window & add / link bug windows (fman) - closed.
- 0006006: [Export/Import] Requirement relations are not exported and cannot be imported (fman) - closed.
- 0006174: [Reports] Requirements based Report - No execute content display when clicking "exec_icon.png" icon (fman) - closed.
- 0006184: [New Feature] Add a new api call to enable assigning of Tester to the test case execution to the entire test suite or the test case or both (fman) - closed.
- 0006139: [Bug Tracking System - JIRA Integration] IssueTracker connection, execution shows debug message in the GUI (fman) - closed.
- 0004213: [Export/Import] Duplicate test cases are created when importing new versions with edited TC Name (xml format) (fman) - closed.
- 0006258: [User Authentication Methods] User cannot login after change Authentication method from LDAP to DB (fman) - closed.
- 0002515: [Users and Rights] Auto Create User on Successful LDAP Authentication (fman) - closed.
- 0006132: [Test Execute - 'Save and move to next'] 'Save and move to next' button has the same behaviour as 'Save' (fman) - closed.
- 0005757: [Bug Tracking System - Redmine Integration] Can not create issue from TL (fman) - closed.
- 0004415: [Internal issue] missing argument in error text ( file xmlrpc.class.php line 2265 ) (fman) - closed.
- 0004720: [Test Execute] Filter by Result =ANY, After screen refresh filter values return to default (fman) - closed.
- 0006086: [Test Execute - 'Save and move to next'] "Save an move to next" doesn't work (fman) - closed.
- 0006057: [Bug Tracking System - JIRA Integration] Jira integration via SOAP is broken due to changes in jirasoapInterface.class.php (not true just debug message printed) (fman) - closed.

[105 issues]



Copyright © 2000 - 2018 MantisBT Team
Powered by Mantis Bugtracker